yzc577亚洲城娱乐clang: error: unable to execute command: Segmentation fault: 11

( yzc577亚洲城娱乐 )

前几天更新了一下 xcode7.3打包之后上传会构建版本失败,就有下载了一个7.2,把7.3删除后安装7.2,打包报错
clang: error: unable to execute command: Segmentation fault: 11
clang: error: linker command failed due to signal (use -v to see invocation)
是7.3没有卸载完全有残留还是其他原因?希望给个解决办法

(看完/读完)这篇文章有何感想! yzc577亚洲城娱乐的分享…

发表评论

电子邮件地址不会被公开。 必填项已用*标注